Run of fresh-releases for certgraph

688
689
690
691
692
693
694
695
696
697
698
699
700
701
702
	cd _build && go install -trimpath -v -p 16 github.com/lanrat/certgraph github.com/lanrat/certgraph/dns github.com/lanrat/certgraph/driver github.com/lanrat/certgraph/driver/crtsh github.com/lanrat/certgraph/driver/google github.com/lanrat/certgraph/driver/http github.com/lanrat/certgraph/driver/multi github.com/lanrat/certgraph/driver/smtp github.com/lanrat/certgraph/fingerprint github.com/lanrat/certgraph/graph github.com/lanrat/certgraph/status github.com/lanrat/certgraph/web
src/github.com/lanrat/certgraph/certgraph.go:4:2: cannot find package "embed" in any of:
	/usr/src/embed (from $GOROOT)
	/<<PKGBUILDDIR>>/_build/src/embed (from $GOPATH)
src/github.com/lanrat/certgraph/driver/multi/multi_driver.go:12:2: cannot find package "golang.org/x/sync/errgroup" in any of:
	/usr/src/golang.org/x/sync/errgroup (from $GOROOT)
	/<<PKGBUILDDIR>>/_build/src/golang.org/x/sync/errgroup (from $GOPATH)
src/github.com/lanrat/certgraph/web/web.go:5:2: cannot find package "io/fs" in any of:
	/usr/src/io/fs (from $GOROOT)
	/<<PKGBUILDDIR>>/_build/src/io/fs (from $GOPATH)
dh_auto_build: error: cd _build && go install -trimpath -v -p 16 github.com/lanrat/certgraph github.com/lanrat/certgraph/dns github.com/lanrat/certgraph/driver github.com/lanrat/certgraph/driver/crtsh github.com/lanrat/certgraph/driver/google github.com/lanrat/certgraph/driver/http github.com/lanrat/certgraph/driver/multi github.com/lanrat/certgraph/driver/smtp github.com/lanrat/certgraph/fingerprint github.com/lanrat/certgraph/graph github.com/lanrat/certgraph/status github.com/lanrat/certgraph/web returned exit code 1
make: *** [debian/rules:7: binary] Error 25
dpkg-buildpackage: error: debian/rules binary subprocess returned exit status 2
--------------------------------------------------------------------------------
Build finished at 2021-08-21T10:35:28Z
Full worker log

Summary

Merged new upstream version: 20210224 (was: 20180911).

Publish Blockers

  • ☒ run was not successful
  • ☑ package has not been removed from the archive
  • ☒ command changed from DEB_UPDATE_CHANGELOG=auto new-upstream --debian-revision=0kali1 --require-uscan --refresh-patches to deb-new-upstream --debian-revision=0kali1 --require-uscan --refresh-patches --skip-empty
  • ☑ review not required
  • ☑ 0 publish attempts so far.not currently attempting to back off
  • ☑ proposals not currently being rate-limited for maintainer None
  • ☒ change set 01d09815-83d8-4a3d-8e6a-c743e585768e is working
  • ☑ merge proposals for previous run were not rejected: status.