Run of fresh-releases for certgraph

668
669
670
671
672
673
674
675
676
677
678
679
680
681
682
dpkg-source: info: building certgraph in certgraph_20220513-0kali1~jan+nur1.dsc
 debian/rules binary
dh binary --builddirectory=_build --buildsystem=golang --with=golang
   dh_update_autotools_config -O--builddirectory=_build -O--buildsystem=golang
   dh_autoreconf -O--builddirectory=_build -O--buildsystem=golang
   dh_auto_configure -O--builddirectory=_build -O--buildsystem=golang
   dh_auto_build -O--builddirectory=_build -O--buildsystem=golang
_build/src/github.com/lanrat/certgraph/certgraph.go:41:12: pattern docs/*: no matching files found
	cd _build && go install -trimpath -v -p 16
package .: no Go files in /<<PKGBUILDDIR>>/_build
dh_auto_build: error: cd _build && go install -trimpath -v -p 16 returned exit code 1
make: *** [debian/rules:9: binary] Error 25
dpkg-buildpackage: error: debian/rules binary subprocess returned exit status 2
--------------------------------------------------------------------------------
Build finished at 2022-05-23T23:36:40Z
Full worker log

Publish Blockers

  • ☒ run was not successful
  • ☑ package has not been removed from the archive
  • ☒ command changed from DEB_UPDATE_CHANGELOG=auto deb-new-upstream --debian-revision=0kali1 --require-uscan --refresh-patches to deb-new-upstream --debian-revision=0kali1 --require-uscan --refresh-patches --skip-empty
  • ☑ review not required
  • ☑ 0 publish attempts so far.not currently attempting to back off
  • ☑ proposals not currently being rate-limited for maintainer None
  • ☑ change set 8fe97e06-2ac2-4fe3-8496-d96ce5e22d76 is ready
  • ☑ merge proposals for previous run were not rejected: status.