Run of fresh-releases for certgraph

675
676
677
678
679
680
681
682
683
684
685
686
687
688
689
dpkg-source: info: building certgraph in certgraph_20220513-0kali1~jan+nur1.dsc
 debian/rules binary
dh binary --builddirectory=_build --buildsystem=golang --with=golang
   dh_update_autotools_config -O--builddirectory=_build -O--buildsystem=golang
   dh_autoreconf -O--builddirectory=_build -O--buildsystem=golang
   dh_auto_configure -O--builddirectory=_build -O--buildsystem=golang
   dh_auto_build -O--builddirectory=_build -O--buildsystem=golang
_build/src/github.com/lanrat/certgraph/certgraph.go:41:12: pattern docs/*: no matching files found
	cd _build && go install -trimpath -v -p 16
package .: no Go files in /<<PKGBUILDDIR>>/_build
dh_auto_build: error: cd _build && go install -trimpath -v -p 16 returned exit code 1
make: *** [debian/rules:9: binary] Error 25
dpkg-buildpackage: error: debian/rules binary subprocess returned exit status 2
--------------------------------------------------------------------------------
Build finished at 2022-11-24T03:52:09Z
Full worker log

Publish Blockers

  • ☒ run was not successful
  • ☑ package has not been removed from the archive
  • ☑ command has not changed
  • ☑ review not required
  • ☑ 0 publish attempts so far.not currently attempting to back off
  • ☑ proposals not currently being rate-limited for maintainer None
  • ☒ change set d960c48e-a500-4dea-b2c1-f3dce5bee045 is working
  • ☑ merge proposals for previous run were not rejected: status.