Run of fresh-snapshots for gitleaks

Try this locally package):

debcheckout gitleaks
cd gitleaks
new-upstream --snapshot
1103
1104
1105
1106
1107
1108
1109
1110
1111
1112
1113
1114
1115
1116
1117
	/<<PKGBUILDDIR>>/_build/src/github.com/zricethezav/gitleaks/scan/commit.go:60
scan.func3
	/<<PKGBUILDDIR>>/_build/src/github.com/zricethezav/gitleaks/scan/repo.go:88
errgroup.func1
	/<<PKGBUILDDIR>>/_build/src/golang.org/x/sync/errgroup/errgroup.go:57
created by golang.x2eorg..z2fx..z2fsync..z2ferrgroup.Group.Go
	/<<PKGBUILDDIR>>/_build/src/golang.org/x/sync/errgroup/errgroup.go:54 +0xe3
FAIL	github.com/zricethezav/gitleaks/scan	0.321s
?   	github.com/zricethezav/gitleaks/version	[no test files]
FAIL
dh_auto_test: error: cd _build && go test -vet=off -v -p 16 github.com/zricethezav/gitleaks github.com/zricethezav/gitleaks/config github.com/zricethezav/gitleaks/options github.com/zricethezav/gitleaks/scan github.com/zricethezav/gitleaks/version returned exit code 1
make[1]: *** [debian/rules:11: override_dh_auto_test] Error 25
make[1]: Leaving directory '/<<PKGBUILDDIR>>'
make: *** [debian/rules:4: binary] Error 2
dpkg-buildpackage: error: debian/rules binary subprocess returned exit status 2

Summary

new-upstream --snapshot

Full worker log Full build log Full dist log