Run of fresh-releases for golang-github-domainr-whoistest

618
619
620
621
622
623
624
625
626
627
628
629
630
631
632
   dh_update_autotools_config -O--builddirectory=_build -O--buildsystem=golang
   dh_autoreconf -O--builddirectory=_build -O--buildsystem=golang
   dh_auto_configure -O--builddirectory=_build -O--buildsystem=golang
dh_auto_configure: warning: "github.com/domainr/whoistest" is already installed. Please check for circular dependencies.

   dh_auto_build -O--builddirectory=_build -O--buildsystem=golang
	cd _build && go install -trimpath -v -p 16 github.com/domainr/whoistest github.com/domainr/whoistest/cmd/enum github.com/domainr/whoistest/cmd/gen
src/github.com/domainr/whois/response.go:18:2: cannot find package "github.com/saintfish/chardet" in any of:
	/usr/src/github.com/saintfish/chardet (from $GOROOT)
	/<<PKGBUILDDIR>>/_build/src/github.com/saintfish/chardet (from $GOPATH)
dh_auto_build: error: cd _build && go install -trimpath -v -p 16 github.com/domainr/whoistest github.com/domainr/whoistest/cmd/enum github.com/domainr/whoistest/cmd/gen returned exit code 1
make: *** [debian/rules:4: binary] Error 25
dpkg-buildpackage: error: debian/rules binary subprocess returned exit status 2
--------------------------------------------------------------------------------
Build finished at 2022-11-05T01:20:05Z
Full worker log

Publish Blockers

  • ☒ run was not successful
  • ☑ package has not been removed from the archive
  • ☑ command has not changed
  • ☑ review not required
  • ☑ 0 publish attempts so far.not currently attempting to back off
  • ☑ proposals not currently being rate-limited for maintainer None
  • ☒ change set 6a367909-b47e-48ee-97b3-5a674fd511d4 is working
  • ☑ merge proposals for previous run were not rejected: status.