Run of fresh-releases for golang-github-domainr-whoistest

599
600
601
602
603
604
605
606
607
608
609
610
611
612
613
   dh_update_autotools_config -O--builddirectory=_build -O--buildsystem=golang
   dh_autoreconf -O--builddirectory=_build -O--buildsystem=golang
   dh_auto_configure -O--builddirectory=_build -O--buildsystem=golang
dh_auto_configure: warning: "github.com/domainr/whoistest" is already installed. Please check for circular dependencies.

   dh_auto_build -O--builddirectory=_build -O--buildsystem=golang
	cd _build && go install -trimpath -v -p 16 github.com/domainr/whoistest github.com/domainr/whoistest/cmd/enum github.com/domainr/whoistest/cmd/gen
src/github.com/domainr/whois/response.go:18:2: cannot find package "github.com/saintfish/chardet" in any of:
	/usr/src/github.com/saintfish/chardet (from $GOROOT)
	/<<PKGBUILDDIR>>/_build/src/github.com/saintfish/chardet (from $GOPATH)
dh_auto_build: error: cd _build && go install -trimpath -v -p 16 github.com/domainr/whoistest github.com/domainr/whoistest/cmd/enum github.com/domainr/whoistest/cmd/gen returned exit code 1
make: *** [debian/rules:4: binary] Error 25
dpkg-buildpackage: error: debian/rules binary subprocess returned exit status 2
--------------------------------------------------------------------------------
Build finished at 2021-05-18T17:37:55Z
Full worker log

Summary

Merged new upstream version: 0.0~git20210517.2e8aa56 (was: 0.0~git20200925.f2cbdbb).

Publish Blockers

  • ☒ run was not successful
  • ☑ package has not been removed from the archive
  • ☒ command changed from new-upstream --debian-revision=0kali1 --require-uscan --refresh-patches to deb-new-upstream --debian-revision=0kali1 --require-uscan --refresh-patches --skip-empty
  • ☑ review not required
  • ☑ 0 publish attempts so far.not currently attempting to back off
  • ☑ proposals not currently being rate-limited for maintainer None
  • ☒ change set c16798a1-c5a1-4bad-826d-456440ca914b is working
  • ☑ merge proposals for previous run were not rejected: status.