Run of fresh-releases for gospider

965
966
967
968
969
970
971
972
973
974
975
976
977
978
979
=== RUN   TestGetWaybackURLs
    othersource_test.go:34: http: unexpected EOF reading trailer
--- FAIL: TestGetWaybackURLs (3.75s)
=== RUN   TestGetExtType
    utils_test.go:7: .jpg
--- PASS: TestGetExtType (0.00s)
FAIL
FAIL	github.com/jaeles-project/gospider/core	53.317s
?   	github.com/jaeles-project/gospider/stringset	[no test files]
FAIL
dh_auto_test: error: cd _build && go test -vet=off -v -p 16 github.com/jaeles-project/gospider github.com/jaeles-project/gospider/core github.com/jaeles-project/gospider/stringset returned exit code 1
make: *** [debian/rules:4: binary] Error 25
dpkg-buildpackage: error: debian/rules binary subprocess returned exit status 2
--------------------------------------------------------------------------------
Build finished at 2020-11-24T08:13:37Z
Full worker log

Summary

Merged new upstream version: 1.1.2 (was: 1.1.0).

Publish Blockers

  • ☒ run was not successful
  • ☑ package has not been removed from the archive
  • ☒ command changed from new-upstream --import-only to deb-new-upstream --debian-revision=0kali1 --require-uscan --refresh-patches --skip-empty
  • ☑ review not required
  • ☑ 1 publish attempts so far.not currently attempting to back off
  • ☑ proposals not currently being rate-limited for maintainer None
  • ☒ change set 80ef4767-3d04-4a10-91b3-5bc56be3401a is working
  • ☑ no relevant previous merge proposals