Run of fresh-releases for oclgausscrack

1
2
3
4
5
6
7
8
9
10
11
12
13
14
15
16
17
18
19
20
21
22
23
24
25
26
27
28
29
30
31
32
33
34
35
36
37
38
39
40
41
42
43
44
45
46
47
48
49
50
51
52
53
54
55
56
57
58
59
60
61
62
63
64
65
66
67
68
69
70
71
72
73
74
75
76
77
78
79
80
81
82
83
84
85
86
87
88
89
90
91
92
93
94
95
96
97
98
99
100
[2022-03-31 12:25:19] Opening branch at https://gitlab.com/kalilinux/packages/oclgausscrack.git/,branch=kali%2Fmaster
[2022-03-31 12:25:20] Using cached branch https://janitor.kali.org/git/oclgausscrack/,branch=kali%2Flatest
[2022-03-31 12:25:20] Total 198 (delta 29), reused 169 (delta 0)
[2022-03-31 12:25:22] Total 55 (delta 27), reused 28 (delta 0)
[2022-03-31 12:25:25] Total 20 (delta 1), reused 1 (delta 1), pack-reused 19
[2022-03-31 12:25:25] All changes applied successfully.
[2022-03-31 12:25:31] Total 5 (delta 0), reused 0 (delta 0), pack-reused 5
[2022-03-31 12:25:31] Workspace ready - starting.
[2022-03-31 12:25:31] Running ['deb-new-upstream', '--debian-revision=0kali1', '--require-uscan', '--refresh-patches']
[2022-03-31 12:25:31] Assuming changelog does not need to be updated, since there is a [dch] section in gbp.conf.
Using upstream branch https://github.com/jsteube/oclGaussCrack.git (guessed)
Total 36 (delta 0), reused 3 (delta 0), pack-reused 29
Using version string 1.4.
No upstream upstream-revision format specified, trying tag:1.3
No upstream upstream-revision format specified, trying tag:oclgausscrack-1.3
No upstream upstream-revision format specified, trying tag:v1.3
No upstream upstream-revision format specified, trying tag:v.1.3
No upstream upstream-revision format specified, trying tag:release-1.3
No upstream upstream-revision format specified, trying tag:1_3_release
No upstream upstream-revision format specified, trying tag:1_3
No upstream upstream-revision format specified, trying tag:version-1.3
No upstream upstream-revision format specified, trying tag:oclgausscrack-1_3-release
No upstream upstream-revision format specified, trying tag:oclgausscrack-v1.3
Old upstream version '1.3' is not present in upstream branch <UpstreamBranchSource for 'https://github.com/jsteube/oclGaussCrack.git/'>. Unable to determine whether upstream history is normally included. Assuming no.
Using uscan to look for the upstream tarball.
Use of uninitialized value in concatenation (.) or string at /usr/share/perl5/Devscripts/Uscan/WatchLine.pm line 868.
uupdate: debian/source/format is "3.0 (quilt)".
uupdate: Auto-generating oclgausscrack_1.3-1kali3.debian.tar.xz
uupdate: -> Copy to      oclgausscrack_1.4-1.debian.tar.xz
Revision b'git-v1:e0fb89aee382e2d356c55edac4b9477f726119c8' exists in repository but not in upstream branch, ignoring
Revision b'git-v1:e0fb89aee382e2d356c55edac4b9477f726119c8' exists in repository but not in upstream branch, ignoring
Imported oclgausscrack_1.4.orig.tar.gz with pristine-tar.
All changes applied successfully.
Found tag for topmost changelog version '8a1bc61e6132b6dec9250e779452672551fe724b'
Committing to: /home/janitor/tmp/janitorgptjrdoi/oclgausscrack/
modified Makefile
added README.md
modified debian/changelog
modified doc/CHANGES
renamed doc/COPYING => doc/LICENSE
deleted doc/README
deleted gaussCombinator32.bin
deleted gaussCombinator64.bin
deleted gaussFilter32.bin
deleted gaussFilter64.bin
deleted oclGaussCrack32.bin
deleted oclGaussCrack64.bin
modified src/Makefile
modified src/oclGaussCrack.c
Committed revision 24.
Merged new upstream version 1.4 (previous: 1.3)
Merge new upstream version 1.4
[2022-03-31 12:26:24] Actual command: ['deb-new-upstream', '--debian-revision=0kali1', '--require-uscan', '--refresh-patches']
[2022-03-31 12:26:24] Opened schroot session kali-dev-amd64-sbuild-f36081c4-58aa-4be6-a436-e6b261e318d8 (from kali-dev-amd64-sbuild)
[2022-03-31 12:26:24] Using fixers: [PgBuildExtOutOfDateControlFixer(), SimpleBuildFixer(MissingConfigure, fix_missing_configure), SimpleBuildFixer(MissingAutomakeInput, fix_missing_automake_input), SimpleBuildFixer(MissingConfigStatusInput, fix_missing_config_status_input), SimpleBuildFixer(MissingPerlFile, fix_missing_makefile_pl), SimpleBuildFixer(DebcargoUnacceptablePredicate, coerce_unacceptable_predicate), DependencyBuildFixer(AptFetchFailure, retry_apt_failure), PackageDependencyFixer(AptResolver(<ognibuild.debian.apt.AptManager object at 0x7fbe1d49b588>, [functools.partial(<function python_tie_breaker at 0x7fbe17206158>, <GitWorkingTree of /home/janitor/tmp/janitorgptjrdoi/oclgausscrack>, ''), BuildDependencyTieBreaker('/var/run/schroot/mount/kali-dev-amd64-sbuild-f36081c4-58aa-4be6-a436-e6b261e318d8'), <function popcon_tie_breaker at 0x7fbe17204a60>]))]
[2022-03-31 12:26:24] Building debian packages, running 'sbuild -Asv --dpkg-file-suffix=+jan --force-orig-source --source-only-changes'.
Traceback (most recent call last):
  File "/opt/janitor/ognibuild/ognibuild/debian/build.py", line 205, in build
    args, cwd=local_tree.abspath(subpath), stdout=outf, stderr=outf, env=env
  File "/usr/lib/python3.7/subprocess.py", line 347, in check_call
    raise CalledProcessError(retcode, cmd)
subprocess.CalledProcessError: Command '['/usr/bin/python3', '-m', 'breezy', 'builddeb', '--guess-upstream-branch-url', '--builder=sbuild -Asv --dpkg-file-suffix=+jan --force-orig-source --source-only-changes', '--result-dir=/home/janitor/tmp/janitorgptjrdoi']' returned non-zero exit status 3.

During handling of the above exception, another exception occurred:

Traceback (most recent call last):
  File "/opt/janitor/ognibuild/ognibuild/debian/build.py", line 232, in build_once
    extra_repositories=extra_repositories,
  File "/opt/janitor/ognibuild/ognibuild/debian/build.py", line 208, in build
    raise BuildFailedError()
breezy.plugins.debian.builder.BuildFailedError: The build failed.

During handling of the above exception, another exception occurred:

Traceback (most recent call last):
  File "/opt/janitor/janitor/worker.py", line 1027, in run_worker
    force_build=force_build
  File "/usr/lib/python3.7/contextlib.py", line 112, in __enter__
    return next(self.gen)
  File "/opt/janitor/janitor/worker.py", line 784, in process_package
    ws, subpath, output_directory, env)
  File "/opt/janitor/janitor/worker.py", line 382, in build
    max_iterations=MAX_BUILD_ITERATIONS
  File "/opt/janitor/ognibuild/ognibuild/debian/fix_build.py", line 524, in build_incrementally
    extra_repositories=extra_repositories,
  File "/opt/janitor/ognibuild/ognibuild/debian/build.py", line 301, in attempt_build
    extra_repositories=extra_repositories,
  File "/opt/janitor/ognibuild/ognibuild/debian/build.py", line 236, in build_once
    sbuild_failure = worker_failure_from_sbuild_log(f)
  File "/opt/janitor/buildlog-consultant/buildlog_consultant/sbuild.py", line 864, in worker_failure_from_sbuild_log
    sbuildlog, failed_stage
  File "/opt/janitor/buildlog-consultant/buildlog_consultant/sbuild.py", line 713, in find_failure_build
    match, error = find_build_failure_description(section_lines)
  File "/opt/janitor/buildlog-consultant/buildlog_consultant/common.py", line 3763, in find_build_failure_description
    linenos, err = matcher.match(lines, lineno)
  File "/opt/janitor/buildlog-consultant/buildlog_consultant/common.py", line 912, in match
    err = self.cb(m)
  File "/opt/janitor/buildlog-consultant/buildlog_consultant/common.py", line 222, in file_not_found
    if m.group(1).startswith("/") and not m.group(1).startswith("/<<PKGBUILDDIR>>"):
IndexError: no such group
Full worker log

Publish Blockers

  • ☒ run was not successful
  • ☑ package has not been removed from the archive
  • ☒ command changed from DEB_UPDATE_CHANGELOG=auto deb-new-upstream --debian-revision=0kali1 --require-uscan --refresh-patches to deb-new-upstream --debian-revision=0kali1 --require-uscan --refresh-patches --skip-empty
  • ☑ review not required
  • ☑ 0 publish attempts so far.not currently attempting to back off
  • ☑ proposals not currently being rate-limited for maintainer None
  • ☒ change set 73cbab0f-940b-4311-a780-260ddbe8a059 is working
  • ☑ no relevant previous merge proposals