Run of fresh-releases for osrframework

13
14
15
16
17
18
19
20
21
patching file setup.py
Hunk #2 FAILED at 108.
1 out of 2 hunks FAILED
dpkg-source: info: the patch has fuzz which is not allowed, or is malformed
dpkg-source: info: if patch 'upgrade-installation.patch' is correctly applied by quilt, use 'quilt refresh' to update it
dpkg-source: info: restoring quilt backup files for upgrade-installation.patch
dpkg-source: error: LC_ALL=C patch -t -F 0 -N -p1 -u -V never -E -b -B .pc/upgrade-installation.patch/ --reject-file=- < osrframework-0.20.1/debian/patches/upgrade-installation.patch subprocess returned exit status 1
E: Failed to run dpkg-source --before-build /tmp/tmp62j0lmgq/build-area/osrframework-0.20.1
brz: ERROR: The build failed.
Full worker log

Summary

Merged new upstream version: 0.20.2 (was: 0.20.1).

Publish Blockers

  • ☒ run was not successful
  • ☑ package has not been removed from the archive
  • ☒ command changed from new-upstream to deb-new-upstream --debian-revision=0kali1 --require-uscan --refresh-patches --skip-empty
  • ☑ review not required
  • ☑ 0 publish attempts so far.not currently attempting to back off
  • ☑ proposals not currently being rate-limited for maintainer None
  • ☒ change set 38fbf3c8-9e1e-403d-979d-c4a01d44c86e is working
  • ☑ merge proposals for previous run were not rejected: status.