Run of fresh-releases for poshc2

1
2
3
4
5
6
7
8
9
10
11
12
13
14
15
16
17
18
19
20
21
22
23
24
25
26
27
28
29
30
31
32
33
34
35
36
37
38
39
40
41
42
43
44
45
46
47
48
49
50
51
52
53
54
55
56
57
58
59
60
61
62
63
64
65
66
67
68
69
70
71
72
73
74
75
76
77
78
79
80
81
82
83
84
85
86
87
88
89
90
91
92
93
94
95
96
97
98
99
100
101
102
103
104
105
106
107
108
109
110
111
112
113
114
115
116
117
118
119
120
121
122
123
124
125
126
127
128
129
130
131
132
133
134
135
136
137
138
139
140
141
142
143
144
145
146
147
148
149
150
151
152
153
154
155
156
157
158
159
160
161
162
163
164
165
166
167
168
169
170
171
172
173
174
175
176
177
178
179
180
181
182
183
184
185
186
187
188
189
190
191
[2021-10-17 20:06:53] Opening branch at https://gitlab.com/kalilinux/packages/poshc2.git/,branch=kali%2Fmaster
[2021-10-17 20:06:53] Using cached branch https://janitor.kali.org/git/poshc2/,branch=kali%2Flatest
[2021-10-17 20:06:55] Total 759 (delta 276), reused 479 (delta 0)
[2021-10-17 20:06:55] 
[2021-10-17 20:07:02] Total 274 (delta 211), reused 62 (delta 0)
[2021-10-17 20:07:04] Total 4 (delta 0), reused 4 (delta 0), pack-reused 0
[2021-10-17 20:07:07] Total 4 (delta 0), reused 4 (delta 0), pack-reused 0
[2021-10-17 20:07:09] Total 4 (delta 0), reused 4 (delta 0), pack-reused 0
[2021-10-17 20:07:09] Workspace ready - starting.
[2021-10-17 20:07:09] Running ['deb-new-upstream', '--debian-revision=0kali1', '--require-uscan', '--refresh-patches']
[2021-10-17 20:07:09] Assuming changelog does not need to be updated, since there is a [dch] section in gbp.conf.
Using upstream branch https://github.com/nettitude/PoshC2.git (from configuration)
Total 5026 (delta 20), reused 26 (delta 9), pack-reused 4972
Using version string 7.4.0.
No upstream upstream-revision format specified, trying tag:7.0.5
No upstream upstream-revision format specified, trying tag:poshc2-7.0.5
No upstream upstream-revision format specified, trying tag:v7.0.5
Not including upstream history, since previous upstream version (7.0.5) is not present in packaging branch history.
Using uscan to look for the upstream tarball.
Use of uninitialized value in concatenation (.) or string at /usr/share/perl5/Devscripts/Uscan/WatchLine.pm line 868.
uupdate: debian/source/format is "3.0 (quilt)".
uupdate: Auto-generating poshc2_7.0.5-0kali1.debian.tar.xz
uupdate: -> Copy to      poshc2_7.4.0-1.debian.tar.xz
Imported poshc2_7.4.0.orig.tar.gz with pristine-tar.
All changes applied successfully.
Found tag for topmost changelog version 'a7be2c0b88d6e345888ddca905e578e544575eb1'
No changes detected from a7be2c0b88d6e345888ddca905e578e544575eb1 to HEAD.
Committing to: /home/janitor/tmp/janitorlicl73rp/poshc2/
modified .gitignore
modified Dockerfile
modified Install-for-Docker.sh
modified Install.sh
modified Pipfile
modified Pipfile.lock
modified README.md
modified debian/changelog
modified poshc2/Colours.py
modified poshc2/client/Alias.py
modified poshc2/client/Help.py
modified poshc2/client/cli/CommandPromptCompleter.py
modified poshc2/client/command_handlers/ImplantHandler.py
modified poshc2/client/command_handlers/PSHandler.py
renamed poshc2/client/command_handlers/PbindHandler.py => poshc2/client/command_handlers/FCommHandler.py
modified poshc2/client/command_handlers/PbindHandler.py
renamed poshc2/client/command_handlers/PbindHandler.py => poshc2/client/command_handlers/PbindPivotHandler.py
renamed poshc2/client/command_handlers/PyHandler.py => poshc2/client/command_handlers/JxaHandler.py
modified poshc2/client/command_handlers/PyHandler.py
modified poshc2/client/command_handlers/SharpHandler.py
modified poshc2/client/reporting/HTML.py
added poshc2/client/reporting/ReportColumns.py
modified poshc2/server/AutoLoads.py
modified poshc2/server/C2Server.py
modified poshc2/server/Config.py
modified poshc2/server/Core.py
modified poshc2/server/Implant.py
modified poshc2/server/Tasks.py
modified poshc2/server/database/DB.py
modified poshc2/server/database/DBPostgres.py
modified poshc2/server/database/DBSQLite.py
modified poshc2/server/database/Model.py
modified poshc2/server/payloads/Payloads.py
modified resources/config-template.yml
added resources/images/ReportLogo.png
modified resources/modules/Brute-AD.ps1
modified resources/modules/Brute-LocAdmin.ps1
modified resources/modules/Bypass-UAC.ps1
modified resources/modules/CVE-2016-9192.ps1
modified resources/modules/ConvertTo-Shellcode.ps1
modified resources/modules/Cred-Popper.ps1
modified resources/modules/Decrypt-RDCMan.ps1
modified resources/modules/Dump-NTDS.ps1
modified resources/modules/Exploit-EternalBlue.ps1
added resources/modules/FComm.exe
modified resources/modules/Get-ComputerInfo.ps1
modified resources/modules/Get-FirewallRules.ps1
modified resources/modules/Get-GPPAutologon.ps1
modified resources/modules/Get-Hash.ps1
modified resources/modules/Get-IdleTime.ps1
modified resources/modules/Get-InjectedThread.ps1
modified resources/modules/Get-Keystrokes.ps1
modified resources/modules/Get-LAPSPasswords.ps1
modified resources/modules/Get-MSHotFixes.ps1
modified resources/modules/Get-Netstat.ps1
modified resources/modules/Get-PassNotExp.ps1
modified resources/modules/Get-ScreenshotAllWindows.ps1
modified resources/modules/Get-ServicePerms.ps1
modified resources/modules/Get-TokenElevationType.ps1
modified resources/modules/Get-UserLogons.ps1
modified resources/modules/Get-WLANPass.ps1
added resources/modules/HealthInspector.js
modified resources/modules/HostEnum.ps1
modified resources/modules/Inveigh-Relay.ps1
modified resources/modules/Inveigh.ps1
modified resources/modules/Invoke-Arpscan.ps1
modified resources/modules/Invoke-Hostscan.ps1
modified resources/modules/Invoke-InveighUnprivileged.ps1
modified resources/modules/Invoke-PowerDump.ps1
modified resources/modules/Invoke-PsExec.ps1
modified resources/modules/Invoke-ReflectivePEInjection.ps1
modified resources/modules/Invoke-RunAs.ps1
modified resources/modules/Invoke-SMBClient.ps1
modified resources/modules/Invoke-SMBExec.ps1
modified resources/modules/Invoke-Shellcode.ps1
modified resources/modules/Invoke-Sniffer.ps1
modified resources/modules/Invoke-SqlQuery.ps1
modified resources/modules/Invoke-TheHash.ps1
modified resources/modules/Invoke-URLCheck.ps1
modified resources/modules/Invoke-WMIChecker.ps1
modified resources/modules/Invoke-WMICommand.ps1
modified resources/modules/Invoke-WMIExec.ps1
modified resources/modules/Invoke-WinRMSession.ps1
modified resources/modules/NamedPipe.ps1
modified resources/modules/NamedPipeDaisy.ps1
modified resources/modules/NamedPipeProxy.ps1
modified resources/modules/New-JScriptShell.ps1
added resources/modules/Orchard.js
modified resources/modules/PBind.exe
modified resources/modules/PowerUpSQL_Full.ps1
modified resources/modules/RunAs-NetOnly.ps1
modified resources/modules/SafetyDump.exe
modified resources/modules/Seatbelt.ps1
modified resources/modules/Service-Perms.ps1
modified resources/modules/Set-LHSTokenPrivilege.ps1
modified resources/modules/SharpSocks.ps1
modified resources/modules/Stage2-Core.exe
added resources/modules/StandIn.exe
added resources/modules/SwiftBelt.js
modified resources/modules/Test-ADCredential.ps1
added resources/modules/clipboard_monitor.js
added resources/modules/cred-popper.js
added resources/payload-templates/Implant-Core.js
modified resources/payload-templates/Implant-Core.py
modified resources/payload-templates/Sharp_v2_x64_Shellcode.b64
modified resources/payload-templates/Sharp_v2_x64_dll.b64
modified resources/payload-templates/Sharp_v2_x86_Shellcode.b64
modified resources/payload-templates/Sharp_v2_x86_dll.b64
modified resources/payload-templates/Sharp_v4_x64_Shellcode.b64
modified resources/payload-templates/Sharp_v4_x64_dll.b64
modified resources/payload-templates/Sharp_v4_x86_Shellcode.b64
modified resources/payload-templates/Sharp_v4_x86_dll.b64
modified resources/payload-templates/aes.py
modified resources/payload-templates/dropper.cs
modified resources/payload-templates/dropper.ps1
modified resources/payload-templates/dropper.py
added resources/payload-templates/dropper_jxa.js
added resources/payload-templates/fcomm.cs
modified resources/payload-templates/pbind.ps1
added resources/reporting
added resources/reporting/HTML_Template.html
modified resources/scripts/PoshC2.psm1
modified resources/scripts/_posh-common
renamed resources/scripts/docker-sharpsocks => resources/scripts/sharpsocks-docker
modified resources/scripts/fpc.py
modified resources/scripts/posh-docker-server
modified resources/scripts/posh-project
modified resources/scripts/posh-server
Committed revision 16.
Merged new upstream version 7.4.0 (previous: 7.0.5)
Refresh quilt patches.
An error occurred refreshing quilt patch change-posh-dir.patch: 

Applying patch debian/patches/change-posh-dir.patch
patching file README.md
Hunk #2 succeeded at 221 (offset 8 lines).
patching file poshc2/server/Config.py
patching file resources/config-template.yml
Hunk #1 FAILED at 38.
1 out of 1 hunk FAILED -- rejects in file resources/config-template.yml
patching file resources/scripts/PoshC2.psm1
Hunk #1 FAILED at 140.
Hunk #2 FAILED at 188.
2 out of 2 hunks FAILED -- rejects in file resources/scripts/PoshC2.psm1
patching file resources/scripts/_posh-common
Hunk #1 succeeded at 13 with fuzz 1 (offset 9 lines).
Hunk #2 FAILED at 38.
1 out of 2 hunks FAILED -- rejects in file resources/scripts/_posh-common
patching file resources/scripts/fpc
patching file resources/scripts/fpc.py
patching file resources/scripts/posh
patching file resources/scripts/posh-config
patching file resources/scripts/posh-cookie-decrypter
patching file resources/scripts/posh-docker-server
patching file resources/scripts/posh-log
patching file resources/scripts/posh-project
patching file resources/scripts/posh-server
patching file resources/scripts/posh-service
patching file resources/scripts/posh-service-ansible
patching file resources/scripts/poshc2.service
patching file resources/scripts/sharpsocks
Patch debian/patches/change-posh-dir.patch does not apply (enforce with -f)

Full worker log

Publish Blockers

  • ☒ run was not successful
  • ☑ package has not been removed from the archive
  • ☒ command changed from DEB_UPDATE_CHANGELOG=auto deb-new-upstream --debian-revision=0kali1 --require-uscan --refresh-patches to deb-new-upstream --debian-revision=0kali1 --require-uscan --refresh-patches --skip-empty
  • ☑ review not required
  • ☑ 0 publish attempts so far.not currently attempting to back off
  • ☑ proposals not currently being rate-limited for maintainer None
  • ☒ change set 8a278756-f79d-4a11-a70d-a8d630c9d6e0 is working
  • ☑ no relevant previous merge proposals