Run of fresh-releases for pwncat

Try this locally package):

debcheckout pwncat
cd pwncat
new-upstream --debian-revision=0kali1 --require-uscan --refresh-patches
1
2
3
4
5
6
7
8
9
10
11
12
13
14
15
16
17
18
19
20
21
22
23
24
25
26
27
28
29
30
31
32
33
34
35
36
37
38
39
40
41
42
43
44
45
46
47
48
49
50
51
52
53
54
55
56
57
58
59
60
61
62
63
64
65
[2021-04-29 15:11:52] Running ['new-upstream', '--debian-revision=0kali1', '--require-uscan', '--refresh-patches']
[2021-04-29 15:11:52] Opening branch at https://gitlab.com/kalilinux/packages/pwncat.git/,branch=kali%2Fmaster
[2021-04-29 15:11:52] Using cached branch file:///home/janitor/vcs/git/pwncat/,branch=kali%2Flatest
[2021-04-29 15:11:56] Workspace ready - starting.
[2021-04-29 15:11:56] Using upstream branch https://github.com/cytopia/pwncat.git (from configuration)
[2021-04-29 15:11:57] 3% (25/107)
[2021-04-29 15:11:58] Total 4067 (delta 67), reused 109 (delta 37), pack-reused 3910
[2021-04-29 15:12:03] Using version string 0.1.1.
[2021-04-29 15:12:03] No upstream upstream-revision format specified, trying tag:0.1.0
[2021-04-29 15:12:03] No upstream upstream-revision format specified, trying tag:pwncat-0.1.0
[2021-04-29 15:12:03] No upstream upstream-revision format specified, trying tag:v0.1.0
[2021-04-29 15:12:03] Not including upstream history, since previous upstream version (0.1.0) is not present in packaging branch history.
[2021-04-29 15:12:03] Using uscan to look for the upstream tarball.
Use of uninitialized value in concatenation (.) or string at /usr/share/perl5/Devscripts/Uscan/WatchLine.pm line 868.
uupdate: debian/source/format is "3.0 (quilt)".
uupdate: Auto-generating pwncat_0.1.0-0kali2.debian.tar.xz
uupdate: -> Copy to      pwncat_0.1.1-1.debian.tar.xz
[2021-04-29 15:12:06] Searching for revision importing pwncat version 0.1.0 on packaging branch, tag debian/0.1.0-0kali1.
[2021-04-29 15:12:06] Upstream import of 0.1.0 lacks a tag. Set one by running: brz tag -rrevid:git-v1:89fd5c9f7588f854e7edd3ed189fd47efea3a58f upstream/0.1.0
[2021-04-29 15:12:29] Imported pwncat_0.1.1.orig.tar.gz with pristine-tar.
[2021-04-29 15:12:48] All changes applied successfully.
gbp:info: Changelog last touched at '52026d7a8603c64de3d6dd906dbef42a75c7f5a5'
[2021-04-29 15:12:48] Changelog last touched at '52026d7a8603c64de3d6dd906dbef42a75c7f5a5'
gbp:info: No changes detected from 52026d7a8603c64de3d6dd906dbef42a75c7f5a5 to HEAD.
[2021-04-29 15:12:48] No changes detected from 52026d7a8603c64de3d6dd906dbef42a75c7f5a5 to HEAD.
[2021-04-29 15:12:56] Committing to: /tmp/tmpbzriwzk3/pwncat/
[2021-04-29 15:12:56] added .github/FUNDING.yml
[2021-04-29 15:12:56] modified .github/workflows/building.yml
[2021-04-29 15:12:56] modified .github/workflows/code-black.yml
[2021-04-29 15:12:56] modified .github/workflows/code-mypy.yml
[2021-04-29 15:12:56] modified .github/workflows/code-pycodestyle.yml
[2021-04-29 15:12:56] modified .github/workflows/code-pydocstyle.yml
[2021-04-29 15:12:56] modified .github/workflows/code-pylint.yml
[2021-04-29 15:12:56] modified .github/workflows/linting.yml
[2021-04-29 15:12:56] modified CHANGELOG.md
[2021-04-29 15:12:56] modified Makefile
[2021-04-29 15:12:56] modified README.md
[2021-04-29 15:12:56] modified bin/pwncat
[2021-04-29 15:12:56] modified debian/changelog
[2021-04-29 15:12:56] added docs/CNAME
[2021-04-29 15:12:56] modified docs/index.html
[2021-04-29 15:12:56] modified docs/pwncat.api.html
[2021-04-29 15:12:56] modified docs/pwncat.man.html
[2021-04-29 15:12:56] modified docs/pwncat.type.html
[2021-04-29 15:12:56] modified man/pwncat.1
[2021-04-29 15:12:56] modified setup.cfg
[2021-04-29 15:12:56] modified setup.py
[2021-04-29 15:12:59] Committed revision 4.
[2021-04-29 15:13:02] Merged new upstream version 0.1.1 (previous: 0.1.0)
[2021-04-29 15:13:02] Refresh quilt patches.
[2021-04-29 15:13:03] Worker failed (quilt-refresh-error): An error occurred refreshing quilt patch Remove-privacy-breach-in-documentation.patch: 

Applying patch debian/patches/Remove-privacy-breach-in-documentation.patch
patching file docs/index.html
Hunk #2 FAILED at 120.
Hunk #3 FAILED at 153.
Hunk #4 succeeded at 382 (offset 46 lines).
2 out of 4 hunks FAILED -- rejects in file docs/index.html
patching file docs/pwncat.api.html
Hunk #1 FAILED at 6.
Hunk #2 FAILED at 18076.
2 out of 2 hunks FAILED -- rejects in file docs/pwncat.api.html
Patch debian/patches/Remove-privacy-breach-in-documentation.patch does not apply (enforce with -f)

[2021-04-29 15:13:03] Elapsed time: 0:01:11.156328

Summary

new-upstream --debian-revision=0kali1 --require-uscan --refresh-patches

Full worker log