Run of fresh-releases for pyexcel

1
2
3
4
5
6
7
8
9
10
11
12
13
14
15
16
17
18
19
20
21
22
23
24
25
26
27
28
29
30
31
32
33
34
35
36
37
38
39
40
41
42
43
44
45
46
47
48
49
50
51
52
53
54
55
56
57
58
59
60
61
62
63
64
65
66
67
68
69
70
71
72
73
74
75
76
77
78
79
80
81
82
83
84
85
86
87
88
89
90
91
92
93
94
95
96
97
98
99
100
101
102
103
104
105
106
107
108
109
110
111
112
113
114
115
116
117
118
119
120
121
122
123
124
125
126
127
128
129
130
131
132
133
134
135
136
137
138
139
140
141
142
143
144
145
146
147
148
149
150
151
152
153
154
155
156
157
158
159
160
161
162
163
164
165
166
167
168
169
170
171
172
173
174
175
176
177
178
179
180
181
182
183
184
185
186
187
188
189
190
191
192
193
194
195
196
197
198
199
200
201
202
203
204
205
206
207
208
209
210
211
212
213
214
215
216
217
218
219
220
221
222
223
224
225
226
227
228
229
230
231
232
233
234
235
236
237
238
239
240
241
242
243
244
245
246
247
248
249
250
251
[2021-10-17 23:02:43] Opening branch at https://gitlab.com/kalilinux/packages/pyexcel.git/,branch=kali%2Fmaster
[2021-10-17 23:02:43] Using cached branch https://janitor.kali.org/git/pyexcel/,branch=kali%2Flatest
[2021-10-17 23:02:44] Total 14948 (delta 97), reused 14851 (delta 0)
[2021-10-17 23:02:51] Total 14452 (delta 2496), reused 11956 (delta 0)
[2021-10-17 23:03:02] Workspace ready - starting.
[2021-10-17 23:03:02] Running ['deb-new-upstream', '--debian-revision=0kali1', '--require-uscan', '--refresh-patches']
[2021-10-17 23:03:02] Assuming changelog does not need to be updated, since there is a [dch] section in gbp.conf.
Using upstream branch https://github.com/pyexcel/pyexcel.git (from configuration)
Total 14927 (delta 141), reused 130 (delta 63), pack-reused 14696
Using version string 0.6.7.
No upstream upstream-revision format specified, trying tag:0.5.14
No upstream upstream-revision format specified, trying tag:pyexcel-0.5.14
No upstream upstream-revision format specified, trying tag:v0.5.14
Not including upstream history, since previous upstream version (0.5.14) is not present in packaging branch history.
Using uscan to look for the upstream tarball.
Use of uninitialized value in concatenation (.) or string at /usr/share/perl5/Devscripts/Uscan/WatchLine.pm line 868.
uupdate: debian/source/format is "3.0 (quilt)".
uupdate: Auto-generating pyexcel_0.5.14-0kali3.debian.tar.xz
uupdate: -> Copy to      pyexcel_0.6.7-1.debian.tar.xz
Imported pyexcel_0.6.7.orig.tar.gz with pristine-tar.
All changes applied successfully.
Found tag for topmost changelog version '20525ee26c3dbc21b749ebe93a4584061f629d18'
Committing to: /home/janitor/tmp/janitorjdk45r26/pyexcel/
modified .github/FUNDING.yml
added .github/PULL_REQUEST_TEMPLATE.md
added .github/workflows
added .github/workflows/lint.yml
added .github/workflows/moban-update.yml
added .github/workflows/pythonpublish.yml
added .github/workflows/tests.yml
modified .gitignore
added .isort.cfg
deleted .moban.d/README.rst
added .moban.d/docs/source/bigdata.rst.jj2
modified .moban.d/docs/source/custom_conf.py.jj2
renamed .moban.d/docs/source/guide.rst => .moban.d/docs/source/guide.rst.jj2
modified .moban.d/docs/source/pyexcel-index.rst.jj2
added .moban.d/docs/source/quickstart.rst.jj2
added .moban.d/docs/source/two-liners.rst.jj2
renamed .moban.d/minimum_requirements.txt => .moban.d/minimum_requirements.txt.jj2
added .moban.d/pyexcel-README.rst.jj2
added .moban.d/pyexcel-travis.yml.jj2
renamed .moban.d/setup.py => .moban.d/custom_setup.py.jj2
added .moban.d/supported-file-list.rst.jj2
deleted .moban.d/test.bat
deleted .moban.d/test.sh
renamed .moban.d/tests/requirements.txt => .moban.d/tests/custom_requirements.txt.jj2
deleted .moban.d/travis.yml
modified .moban.yml
added .readthedocs.yml
deleted .travis.yml
modified CHANGELOG.rst
added CONTRIBUTORS.rst
modified LICENSE
modified MANIFEST.in
modified Makefile
modified README.rst
modified changelog.yml
modified debian/changelog
modified docs/requirements.txt
modified docs/source/_static/images/architecture.svg
modified docs/source/api.rst
modified docs/source/attributes.rst
renamed docs/source/bigdata.rst => .moban.d/partial-data.rst.jj2
modified docs/source/bigdata.rst
modified docs/source/book.rst
modified docs/source/conf.py
modified docs/source/database.rst
modified docs/source/design.rst
deleted docs/source/generated/pyexcel.Sheet.columns.rst
deleted docs/source/generated/pyexcel.Sheet.enumerate.rst
added docs/source/generated/pyexcel.Sheet.project.rst
deleted docs/source/generated/pyexcel.Sheet.rcolumns.rst
deleted docs/source/generated/pyexcel.Sheet.reverse.rst
deleted docs/source/generated/pyexcel.Sheet.rows.rst
deleted docs/source/generated/pyexcel.Sheet.rrows.rst
modified docs/source/generated/pyexcel.Sheet.rst
deleted docs/source/generated/pyexcel.Sheet.rvertical.rst
deleted docs/source/generated/pyexcel.Sheet.vertical.rst
modified docs/source/guide.rst
modified docs/source/iapi/pyexcel.internal.sheets.Matrix.rst
modified docs/source/index.rst
modified docs/source/migration_guide.rst
renamed docs/source/quickstart.rst => .moban.d/one-liners.rst.jj2
modified docs/source/quickstart.rst
modified docs/source/renderers.rst
modified docs/source/sheet.rst
modified docs/source/sources.rst
modified docs/source/tutorial.rst
modified docs/source/tutorial_file.rst
renamed docs/source/two-liners.rst => .moban.d/two-liners.rst.jj2
modified docs/source/two-liners.rst
modified docs/source/uml/architecture.uml
added format.sh
modified lint.sh
modified min_requirements.txt
modified pyexcel.yml
modified pyexcel/__version__.py
modified pyexcel/_compact.py
modified pyexcel/book.py
modified pyexcel/constants.py
modified pyexcel/core.py
modified pyexcel/deprecated.py
modified pyexcel/docstrings/__init__.py
modified pyexcel/docstrings/core.py
modified pyexcel/docstrings/keywords.py
modified pyexcel/docstrings/meta.py
modified pyexcel/exceptions.py
modified pyexcel/ext/ods.py
modified pyexcel/ext/ods3.py
modified pyexcel/ext/text.py
modified pyexcel/ext/xls.py
modified pyexcel/ext/xlsx.py
modified pyexcel/internal/__init__.py
modified pyexcel/internal/attributes.py
modified pyexcel/internal/common.py
modified pyexcel/internal/core.py
modified pyexcel/internal/garbagecollector.py
modified pyexcel/internal/generators.py
modified pyexcel/internal/meta.py
modified pyexcel/internal/plugins.py
modified pyexcel/internal/sheets/_shared.py
modified pyexcel/internal/sheets/column.py
modified pyexcel/internal/sheets/formatters.py
modified pyexcel/internal/sheets/matrix.py
modified pyexcel/internal/sheets/row.py
modified pyexcel/internal/source_plugin.py
modified pyexcel/parser.py
modified pyexcel/plugins/__init__.py
modified pyexcel/plugins/parsers/__init__.py
modified pyexcel/plugins/parsers/django.py
modified pyexcel/plugins/parsers/excel.py
modified pyexcel/plugins/parsers/sqlalchemy.py
modified pyexcel/plugins/renderers/__init__.py
modified pyexcel/plugins/renderers/_texttable.py
modified pyexcel/plugins/renderers/django.py
modified pyexcel/plugins/renderers/excel.py
modified pyexcel/plugins/renderers/sqlalchemy.py
modified pyexcel/plugins/sources/__init__.py
modified pyexcel/plugins/sources/db_sources.py
modified pyexcel/plugins/sources/django.py
modified pyexcel/plugins/sources/file_input.py
modified pyexcel/plugins/sources/file_output.py
modified pyexcel/plugins/sources/http.py
modified pyexcel/plugins/sources/memory_input.py
modified pyexcel/plugins/sources/output_to_memory.py
modified pyexcel/plugins/sources/params.py
modified pyexcel/plugins/sources/pydata/arraysource.py
modified pyexcel/plugins/sources/pydata/bookdict.py
modified pyexcel/plugins/sources/pydata/common.py
modified pyexcel/plugins/sources/pydata/dictsource.py
modified pyexcel/plugins/sources/pydata/records.py
modified pyexcel/plugins/sources/querysets.py
modified pyexcel/plugins/sources/sheet_stream_source.py
modified pyexcel/plugins/sources/sqlalchemy.py
modified pyexcel/renderer.py
modified pyexcel/sheet.py
modified pyexcel/source.py
modified requirements.txt
modified rnd_requirements.txt
modified setup.py
modified test.bat
modified test.sh
modified tests/base.py
added tests/fixtures/issue_241
added tests/fixtures/issue_241/1.csv
added tests/fixtures/issue_241/2.csv
modified tests/requirements.txt
modified tests/test_book.py
modified tests/test_bug_fixes.py
modified tests/test_deprecation_notes.py
modified tests/test_file_type_as_attribute.py
modified tests/test_formatters.py
modified tests/test_gabagecollector.py
modified tests/test_http_source.py
modified tests/test_internals.py
modified tests/test_iterator.py
modified tests/test_multiple_sheets.py
added tests/test_sheet.py
added tests/test_sheet_access.py
modified tests/test_sheet_attributes.py
modified tests/test_sheet_column.py
modified tests/test_sheet_row.py
modified tests/test_sheet_stream.py
modified tests/test_sheets.py
modified tests/test_utils.py
Committed revision 27.
Merged new upstream version 0.6.7 (previous: 0.5.14)
Refresh quilt patches.
Committing to: /home/janitor/tmp/janitorjdk45r26/pyexcel/
modified debian/patches/drop-failing-test.patch
modified debian/patches/fix-typo.patch
Committed revision 28.
Merge new upstream version 0.6.7
[2021-10-17 23:04:14] Actual command: ['deb-new-upstream', '--debian-revision=0kali1', '--require-uscan', '--refresh-patches']
[2021-10-17 23:04:14] Opened schroot session kali-dev-amd64-sbuild-792ee2f2-62e3-49f4-8209-39b6e9a15787 (from kali-dev-amd64-sbuild)
[2021-10-17 23:04:14] Using fixers: [PgBuildExtOutOfDateControlFixer(), SimpleBuildFixer(MissingConfigure, fix_missing_configure), SimpleBuildFixer(MissingAutomakeInput, fix_missing_automake_input), SimpleBuildFixer(MissingConfigStatusInput, fix_missing_config_status_input), SimpleBuildFixer(MissingPerlFile, fix_missing_makefile_pl), SimpleBuildFixer(DebcargoUnacceptablePredicate, coerce_unacceptable_predicate), DependencyBuildFixer(AptFetchFailure, retry_apt_failure), PackageDependencyFixer(AptResolver(<ognibuild.debian.apt.AptManager object at 0x7f5a1cd71e48>, [functools.partial(<function python_tie_breaker at 0x7f5a32e20598>, <GitWorkingTree of /home/janitor/tmp/janitorjdk45r26/pyexcel>, ''), BuildDependencyTieBreaker('/var/run/schroot/mount/kali-dev-amd64-sbuild-792ee2f2-62e3-49f4-8209-39b6e9a15787'), <function popcon_tie_breaker at 0x7f5a1e828510>]))]
[2021-10-17 23:04:14] Building debian packages, running 'sbuild -Asv --dpkg-file-suffix=+jan --force-orig-source --source-only-changes'.
[2021-10-17 23:10:50] Attempting to use fixer upstream requirement fixer(apt) to address MissingPythonModule('sphinxcontrib', python_version=None, minimum_version=None)
[2021-10-17 23:10:50] Loading apt contents information
[2021-10-17 23:11:26] Adding build dependency: python3-sphinxcontrib-asyncio
[2021-10-17 23:11:32] Building debian packages, running 'sbuild -Asv --dpkg-file-suffix=+jan --force-orig-source --source-only-changes'.
[2021-10-17 23:18:05] Attempting to use fixer upstream requirement fixer(apt) to address MissingPythonModule('sphinxcontrib.excel', python_version=None, minimum_version=None)
[2021-10-17 23:18:16] Failed to resolve error MissingPythonModule('sphinxcontrib.excel', python_version=None, minimum_version=None). Giving up.
Traceback (most recent call last):
  File "/opt/debian-janitor/ognibuild/ognibuild/debian/build.py", line 205, in build
    args, cwd=local_tree.abspath(subpath), stdout=outf, stderr=outf, env=env
  File "/usr/lib/python3.7/subprocess.py", line 347, in check_call
    raise CalledProcessError(retcode, cmd)
subprocess.CalledProcessError: Command '['/usr/bin/python3', '-m', 'breezy', 'builddeb', '--guess-upstream-branch-url', '--builder=sbuild -Asv --dpkg-file-suffix=+jan --force-orig-source --source-only-changes', '--result-dir=/home/janitor/tmp/janitorjdk45r26']' returned non-zero exit status 3.

During handling of the above exception, another exception occurred:

Traceback (most recent call last):
  File "/opt/debian-janitor/ognibuild/ognibuild/debian/build.py", line 232, in build_once
    extra_repositories=extra_repositories,
  File "/opt/debian-janitor/ognibuild/ognibuild/debian/build.py", line 208, in build
    raise BuildFailedError()
breezy.plugins.debian.builder.BuildFailedError: The build failed.

During handling of the above exception, another exception occurred:

Traceback (most recent call last):
  File "/opt/debian-janitor/janitor/worker.py", line 374, in build
    max_iterations=MAX_BUILD_ITERATIONS
  File "/opt/debian-janitor/ognibuild/ognibuild/debian/fix_build.py", line 562, in build_incrementally
    extra_repositories=extra_repositories,
  File "/opt/debian-janitor/ognibuild/ognibuild/debian/build.py", line 301, in attempt_build
    extra_repositories=extra_repositories,
  File "/opt/debian-janitor/ognibuild/ognibuild/debian/build.py", line 244, in build_once
    sbuild_failure.description)
ognibuild.debian.build.DetailedDebianBuildFailure: ('build', ('build',), None, ['sbuild', '-Asv', '--dpkg-file-suffix=+jan', '--force-orig-source', '--source-only-changes'], MissingPythonModule('sphinxcontrib.excel', python_version=None, minimum_version=None), 'Missing python module: sphinxcontrib.excel')

During handling of the above exception, another exception occurred:

Traceback (most recent call last):
  File "/opt/debian-janitor/janitor/worker.py", line 913, in run_worker
    force_build=force_build
  File "/usr/lib/python3.7/contextlib.py", line 112, in __enter__
    return next(self.gen)
  File "/opt/debian-janitor/janitor/worker.py", line 696, in process_package
    ws, subpath, output_directory, env)
  File "/opt/debian-janitor/janitor/worker.py", line 397, in build
    from .debian.missing_deps import resolve_requirement
  File "/opt/debian-janitor/janitor/debian/missing_deps.py", line 25, in <module>
    from lintian_brush.debianize import find_upstream, UpstreamInfo
  File "/opt/debian-janitor/lintian-brush/lintian_brush/debianize.py", line 105, in <module>
    from .debhelper import (
  File "/opt/debian-janitor/lintian-brush/lintian_brush/debhelper.py", line 21, in <module>
    from functools import cache
ImportError: cannot import name 'cache' from 'functools' (/usr/lib/python3.7/functools.py)
Full worker log

Publish Blockers

  • ☒ run was not successful
  • ☑ package has not been removed from the archive
  • ☒ command changed from DEB_UPDATE_CHANGELOG=auto deb-new-upstream --debian-revision=0kali1 --require-uscan --refresh-patches to deb-new-upstream --debian-revision=0kali1 --require-uscan --refresh-patches --skip-empty
  • ☑ review not required
  • ☑ 0 publish attempts so far.not currently attempting to back off
  • ☑ proposals not currently being rate-limited for maintainer None
  • ☒ change set 8b370bdc-d215-4757-bf28-b34ebad7bfc8 is working
  • ☑ merge proposals for previous run were not rejected: status.