Run of fresh-releases for pytest-factoryboy

Try this locally package):

debcheckout pytest-factoryboy
cd pytest-factoryboy
new-upstream --debian-revision=0kali1
13
14
15
16
17
18
19
20
21
dpkg-source: info: using patch list from debian/patches/series
patching file README.rst
Hunk #1 FAILED at 1.
1 out of 1 hunk FAILED
dpkg-source: info: the patch has fuzz which is not allowed, or is malformed
dpkg-source: info: if patch 'remove-privacy-breach.patch' is correctly applied by quilt, use 'quilt refresh' to update it
dpkg-source: error: LC_ALL=C patch -t -F 0 -N -p1 -u -V never -E -b -B .pc/remove-privacy-breach.patch/ --reject-file=- < pytest-factoryboy-2.1.0.orig.cN2ss2/debian/patches/remove-privacy-breach.patch subprocess returned exit status 1
E: Failed to package source directory /tmp/tmpg6558pyu/build-area/pytest-factoryboy-2.1.0
brz: ERROR: The build failed.

Summary

new-upstream --debian-revision=0kali1

Full worker log Full build log