Run of fresh-releases for pytest-factoryboy

Try this locally package):

debcheckout pytest-factoryboy
cd pytest-factoryboy
DEB_UPDATE_CHANGELOG=auto deb-new-upstream --debian-revision=0kali1 --require-uscan --refresh-patches
1
2
3
4
5
6
7
8
9
10
11
12
13
14
15
16
17
18
19
20
21
22
23
24
25
26
27
28
29
30
31
32
33
34
35
36
37
38
39
40
41
42
43
44
45
46
47
48
49
50
51
52
53
54
55
56
57
58
59
60
61
62
63
64
65
66
67
68
69
70
71
72
73
74
75
76
77
78
[2022-05-25 13:09:50] Opening branch at https://gitlab.com/kalilinux/packages/pytest-factoryboy.git/,branch=kali%2Fmaster
[2022-05-25 13:09:50] Using cached branch https://janitor.kali.org/git/pytest-factoryboy/,branch=kali%2Flatest
[2022-05-25 13:09:50] Total 649 (delta 149), reused 496 (delta 0)
[2022-05-25 13:09:54] Total 535 (delta 205), reused 329 (delta 0)
[2022-05-25 13:09:56] delta 0), pack-reused 2
[2022-05-25 13:09:59] delta 0), pack-reused 2
[2022-05-25 13:10:02] delta 0), pack-reused 2
[2022-05-25 13:10:02] Workspace ready - starting.
[2022-05-25 13:10:02] Running ['deb-new-upstream', '--debian-revision=0kali1', '--require-uscan', '--refresh-patches']
[2022-05-25 13:10:02] Assuming changelog does not need to be updated, since there is a [dch] section in gbp.conf.
Using upstream branch https://github.com/pytest-dev/pytest-factoryboy.git (from configuration)
Total 1105 (delta 428), reused 456 (delta 372), pack-reused 509
Using version string 2.3.1.
No upstream upstream-revision format specified, trying tag:2.0.2
Not including upstream history, since previous upstream version (2.0.2) is not present in packaging branch history.
Using uscan to look for the upstream tarball.
Use of uninitialized value in concatenation (.) or string at /usr/share/perl5/Devscripts/Uscan/WatchLine.pm line 868.
uupdate: debian/source/format is "3.0 (quilt)".
uupdate: Auto-generating pytest-factoryboy_2.0.2-0kali3.debian.tar.xz
uupdate: -> Copy to      pytest-factoryboy_2.3.1-1.debian.tar.xz
Imported pytest-factoryboy_2.3.1.orig.tar.gz with pristine-tar.
All changes applied successfully.
Found tag for topmost changelog version 'b1df0a1f376dcae0f0515979b861a3a23304166f'
Committing to: /home/janitor/tmp/janitortd9cubdz/pytest-factoryboy/
added .editorconfig
added .github
added .github/workflows
added .github/workflows/main.yml
modified .gitignore
added .pre-commit-config.yaml
deleted .travis.yml
modified AUTHORS.rst
modified CHANGES.rst
modified MANIFEST.in
modified Makefile
modified README.rst
added RELEASING.md
modified debian/changelog
modified docs/conf.py
modified docs/index.rst
added pyproject.toml
modified pytest_factoryboy/__init__.py
added pytest_factoryboy/codegen.py
added pytest_factoryboy/compat.py
modified pytest_factoryboy/fixture.py
modified pytest_factoryboy/hooks.py
modified pytest_factoryboy/plugin.py
added pytest_factoryboy/py.typed
modified requirements-testing.txt
added setup.cfg
modified setup.py
deleted tests/test_attributes_field.py
modified tests/test_circular.py
modified tests/test_factory_fixtures.py
modified tests/test_lazy_fixture.py
added tests/test_namespaces.py
modified tests/test_postgen_dependencies.py
added tests/test_registration.py
modified tests/test_validation.py
modified tox.ini
Committed revision 18.
Merged new upstream version 2.3.1 (previous: 2.0.2)
Refresh quilt patches.
Committing to: /home/janitor/tmp/janitortd9cubdz/pytest-factoryboy/
modified debian/changelog
missing debian/patches/remove-privacy-breach.patch
deleted debian/patches/remove-privacy-breach.patch
modified debian/patches/series
Committed revision 19.
An error occurred refreshing quilt patch fix-for-pytest-6.patch: 

Applying patch debian/patches/fix-for-pytest-6.patch
patching file pytest_factoryboy/plugin.py
Hunk #1 FAILED at 113.
Hunk #2 FAILED at 124.
2 out of 2 hunks FAILED -- rejects in file pytest_factoryboy/plugin.py
Patch debian/patches/fix-for-pytest-6.patch does not apply (enforce with -f)

Full worker log