Run of fresh-releases for pytest-factoryboy

Try this locally package):

debcheckout pytest-factoryboy
cd pytest-factoryboy
new-upstream --debian-revision=0kali1 --require-uscan --refresh-patches
1
2
3
4
5
6
7
8
9
10
11
12
13
14
15
16
17
18
19
20
21
22
23
24
25
26
27
28
29
30
31
32
33
34
35
36
37
38
39
40
41
42
43
44
45
46
47
48
49
50
51
52
53
54
55
56
57
58
59
60
61
62
63
64
[2021-04-28 10:30:55] Running ['new-upstream', '--debian-revision=0kali1', '--require-uscan', '--refresh-patches']
[2021-04-28 10:30:55] Opening branch at https://gitlab.com/kalilinux/packages/pytest-factoryboy.git/,branch=kali%2Fmaster
[2021-04-28 10:30:56] Using cached branch file:///home/janitor/vcs/git/pytest-factoryboy/,branch=kali%2Flatest
[2021-04-28 10:31:00] Total 8 (delta 0), reused 0 (delta 0), pack-reused 2
[2021-04-28 10:31:04] All changes applied successfully.
[2021-04-28 10:31:04] Workspace ready - starting.
[2021-04-28 10:31:04] Using upstream branch https://github.com/pytest-dev/pytest-factoryboy.git (from configuration)
[2021-04-28 10:31:04] Total 535 (delta 21), reused 10 (delta 5), pack-reused 483
[2021-04-28 10:31:05] Using version string 2.1.0.
[2021-04-28 10:31:05] No upstream upstream-revision format specified, trying tag:2.0.2
[2021-04-28 10:31:05] Not including upstream history, since previous upstream version (2.0.2) is not present in packaging branch history.
[2021-04-28 10:31:05] Using uscan to look for the upstream tarball.
Use of uninitialized value in concatenation (.) or string at /usr/share/perl5/Devscripts/Uscan/WatchLine.pm line 868.
uupdate: debian/source/format is "3.0 (quilt)".
uupdate: Auto-generating pytest-factoryboy_2.0.2-0kali3.debian.tar.xz
uupdate: -> Copy to      pytest-factoryboy_2.1.0-1.debian.tar.xz
[2021-04-28 10:31:07] Searching for revision importing pytest-factoryboy version 2.0.2 on packaging branch, tag debian/2.0.2-0kali1.
[2021-04-28 10:31:07] Upstream import of 2.0.2 lacks a tag. Set one by running: brz tag -rrevid:git-v1:c837f06b00dd14efe9ade0e30277416a1bcfe8e6 upstream/2.0.2
[2021-04-28 10:31:24] Imported pytest-factoryboy_2.1.0.orig.tar.gz with pristine-tar.
[2021-04-28 10:31:42] All changes applied successfully.
gbp:info: Found tag for topmost changelog version 'b1df0a1f376dcae0f0515979b861a3a23304166f'
[2021-04-28 10:31:43] Found tag for topmost changelog version 'b1df0a1f376dcae0f0515979b861a3a23304166f'
[2021-04-28 10:31:51] Committing to: /tmp/tmpv9s_iace/pytest-factoryboy/
[2021-04-28 10:31:51] modified .gitignore
[2021-04-28 10:31:51] added .pre-commit-config.yaml
[2021-04-28 10:31:51] modified .travis.yml
[2021-04-28 10:31:51] modified AUTHORS.rst
[2021-04-28 10:31:51] modified CHANGES.rst
[2021-04-28 10:31:51] modified README.rst
[2021-04-28 10:31:51] modified debian/changelog
[2021-04-28 10:31:51] modified docs/conf.py
[2021-04-28 10:31:51] added pyproject.toml
[2021-04-28 10:31:51] modified pytest_factoryboy/__init__.py
[2021-04-28 10:31:51] added pytest_factoryboy/compat.py
[2021-04-28 10:31:51] modified pytest_factoryboy/fixture.py
[2021-04-28 10:31:51] modified pytest_factoryboy/plugin.py
[2021-04-28 10:31:51] modified requirements-testing.txt
[2021-04-28 10:31:51] added setup.cfg
[2021-04-28 10:31:51] modified setup.py
[2021-04-28 10:31:51] deleted tests/test_attributes_field.py
[2021-04-28 10:31:51] modified tests/test_circular.py
[2021-04-28 10:31:51] modified tests/test_factory_fixtures.py
[2021-04-28 10:31:51] modified tests/test_lazy_fixture.py
[2021-04-28 10:31:51] modified tests/test_postgen_dependencies.py
[2021-04-28 10:31:51] modified tox.ini
[2021-04-28 10:31:53] Committed revision 16.
[2021-04-28 10:31:56] Merged new upstream version 2.1.0 (previous: 2.0.2)
[2021-04-28 10:31:56] Refresh quilt patches.
[2021-04-28 10:32:04] Committing to: /tmp/tmpv9s_iace/pytest-factoryboy/
[2021-04-28 10:32:04] modified debian/changelog
[2021-04-28 10:32:04] missing debian/patches/remove-privacy-breach.patch
[2021-04-28 10:32:04] deleted debian/patches/remove-privacy-breach.patch
[2021-04-28 10:32:04] modified debian/patches/series
[2021-04-28 10:32:07] Committed revision 17.
[2021-04-28 10:32:10] Worker failed (quilt-refresh-error): An error occurred refreshing quilt patch fix-for-pytest-6.patch: 

Applying patch debian/patches/fix-for-pytest-6.patch
patching file pytest_factoryboy/plugin.py
Hunk #1 FAILED at 113.
Hunk #2 FAILED at 124.
2 out of 2 hunks FAILED -- rejects in file pytest_factoryboy/plugin.py
Patch debian/patches/fix-for-pytest-6.patch does not apply (enforce with -f)

[2021-04-28 10:32:10] Elapsed time: 0:01:14.317114

Summary

new-upstream --debian-revision=0kali1 --require-uscan --refresh-patches

Full worker log