Run of fresh-releases for python-flask-session

13
14
15
16
17
18
19
20
21
dpkg-source: info: using patch list from debian/patches/series
patching file docs/conf.py
Hunk #1 FAILED at 106.
1 out of 1 hunk FAILED
dpkg-source: info: the patch has fuzz which is not allowed, or is malformed
dpkg-source: info: if patch 'drop-special-themes.patch' is correctly applied by quilt, use 'quilt refresh' to update it
dpkg-source: error: LC_ALL=C patch -t -F 0 -N -p1 -u -V never -E -b -B .pc/drop-special-themes.patch/ --reject-file=- < python-flask-session-0.3.2.orig.Tajn5w/debian/patches/drop-special-themes.patch subprocess returned exit status 1
E: Failed to package source directory /tmp/tmptj58dqca/build-area/python-flask-session-0.3.2
brz: ERROR: The build failed.
Full worker log

Summary

Merged new upstream version: 0.3.2 (was: 0.3.1).

Publish Blockers

  • ☒ run was not successful
  • ☑ package has not been removed from the archive
  • ☒ command changed from new-upstream --debian-revision=0kali1 to deb-new-upstream --debian-revision=0kali1 --require-uscan --refresh-patches --skip-empty
  • ☑ review not required
  • ☑ 0 publish attempts so far.not currently attempting to back off
  • ☑ proposals not currently being rate-limited for maintainer None
  • ☒ change set 5e061253-c47e-4677-b624-58dabf0e8ff1 is working
  • ☑ merge proposals for previous run were not rejected: status.