Run of fresh-releases for python-graphql-core

13
14
15
16
17
18
19
20
21
dpkg-source: info: using patch list from debian/patches/series
patching file setup.py
Hunk #1 FAILED at 21.
1 out of 1 hunk FAILED
dpkg-source: info: the patch has fuzz which is not allowed, or is malformed
dpkg-source: info: if patch 'Remove-requirements-about-maximal-rx-version.patch' is correctly applied by quilt, use 'quilt refresh' to update it
dpkg-source: error: LC_ALL=C patch -t -F 0 -N -p1 -u -V never -E -b -B .pc/Remove-requirements-about-maximal-rx-version.patch/ --reject-file=- < python-graphql-core-3.1.3.orig.kUj8HE/debian/patches/Remove-requirements-about-maximal-rx-version.patch subprocess returned exit status 1
E: Failed to package source directory /tmp/tmpjt5iec_d/build-area/python-graphql-core-3.1.3
brz: ERROR: The build failed.
Full worker log

Summary

Merged new upstream version: 3.1.3 (was: 2.2.1).

Publish Blockers

  • ☒ run was not successful
  • ☑ package has not been removed from the archive
  • ☒ command changed from new-upstream to deb-new-upstream --debian-revision=0kali1 --require-uscan --refresh-patches --skip-empty
  • ☑ review not required
  • ☑ 0 publish attempts so far.not currently attempting to back off
  • ☑ proposals not currently being rate-limited for maintainer None
  • ☒ change set 5b067881-96eb-40cf-9688-9687da1e90d9 is working
  • ☑ no relevant previous merge proposals