Run of fresh-releases for pywerview

13
14
15
16
17
18
19
20
21
dpkg-source: info: using patch list from debian/patches/series
patching file setup.py
Hunk #1 FAILED at 30.
1 out of 1 hunk FAILED
dpkg-source: info: the patch has fuzz which is not allowed, or is malformed
dpkg-source: info: if patch 'remove-require-pycrypto.patch' is correctly applied by quilt, use 'quilt refresh' to update it
dpkg-source: error: LC_ALL=C patch -t -F 0 -N -p1 -u -V never -E -b -B .pc/remove-require-pycrypto.patch/ --reject-file=- < pywerview-0.3.1.orig.rGtB0P/debian/patches/remove-require-pycrypto.patch subprocess returned exit status 1
E: Failed to package source directory /tmp/tmp3tb4ue50/build-area/pywerview-0.3.1
brz: ERROR: The build failed.
Full worker log

Summary

Merged new upstream version: 0.3.1 (was: 0.2.0+git20191220).

Publish Blockers

  • ☒ run was not successful
  • ☑ package has not been removed from the archive
  • ☒ command changed from new-upstream --debian-revision=0kali1 to deb-new-upstream --debian-revision=0kali1 --require-uscan --refresh-patches --skip-empty
  • ☑ review not required
  • ☑ 0 publish attempts so far.not currently attempting to back off
  • ☑ proposals not currently being rate-limited for maintainer None
  • ☒ change set 96945022-9710-4ba3-b1fa-f417ae607c39 is working
  • ☑ merge proposals for previous run were not rejected: status.