Run of fresh-releases for ruby-sha3

11
12
13
14
15
16
17
18
19
dpkg-source: info: using patch list from debian/patches/series
patching file ext/sha3/extconf.rb
Hunk #1 FAILED at 17.
1 out of 1 hunk FAILED
dpkg-source: info: the patch has fuzz which is not allowed, or is malformed
dpkg-source: info: if patch 'remove-cflags-march.patch' is correctly applied by quilt, use 'quilt refresh' to update it
dpkg-source: error: LC_ALL=C patch -t -F 0 -N -p1 -u -V never -E -b -B .pc/remove-cflags-march.patch/ --reject-file=- < ruby-sha3-1.0.2.orig.yeD8QI/debian/patches/remove-cflags-march.patch subprocess returned exit status 1
E: Failed to package source directory /tmp/tmp8fldpkc0/build-area/ruby-sha3-1.0.2
brz: ERROR: The build failed.
Full worker log

Summary

Merged new upstream version: 1.0.2 (was: 1.0.1).

Publish Blockers

  • ☒ run was not successful
  • ☑ package has not been removed from the archive
  • ☒ command changed from new-upstream --debian-revision=0kali1 to deb-new-upstream --debian-revision=0kali1 --require-uscan --refresh-patches --skip-empty
  • ☑ review not required
  • ☑ 0 publish attempts so far.not currently attempting to back off
  • ☑ proposals not currently being rate-limited for maintainer None
  • ☒ change set 2f3c7c3b-f45d-4a93-ae5b-1d5e473507e8 is working
  • ☑ no relevant previous merge proposals