Run of fresh-snapshots for sherlock

Try this locally package):

debcheckout sherlock
cd sherlock
new-upstream --snapshot
23
24
25
26
27
28
29
30
31
dpkg-source: warning: ignoring deletion of file tests/base.py, use --include-removal to override
dpkg-source: warning: file sherlock-0.9.6~git20191128/.dockerignore has no final newline (either original or modified version)
dpkg-source: error: cannot represent change to images/sherlock_demo.gif: binary file contents changed
dpkg-source: error: add images/sherlock_demo.gif in debian/source/include-binaries if you want to store the modified binary in the debian tarball
dpkg-source: warning: file sherlock-0.9.6~git20191128/removed_sites.md has no final newline (either original or modified version)
dpkg-source: warning: file sherlock-0.9.6~git20191128/sherlock/resources/data.json has no final newline (either original or modified version)
dpkg-source: error: unrepresentable changes to source
E: Failed to package source directory /tmp/tmpap0s5wlf/build-area/sherlock-0.9.6~git20191128
brz: ERROR: The build failed.

Summary

new-upstream --snapshot

Full worker log Full build log