Run of unchanged for truecrack

Try this locally package):

debcheckout truecrack
cd truecrack
just-build
709
710
711
712
713
714
715
716
717
718
719
720
721
722
723
/usr/bin/ld: Main.o:./src/Main/Core.h:65: multiple definition of `CORE_prefix'; CpuCore.o:./src/./Main/Core.h:65: first defined here
/usr/bin/ld: Main.o:./src/Main/Core.h:39: multiple definition of `CORE_wordsPath'; CpuCore.o:./src/./Main/Core.h:39: first defined here
/usr/bin/ld: CpuAes.o:./src/Crypto/CpuAes.h:1258: multiple definition of `t_fl'; CpuCore.o:./src/./Crypto/CpuAes.h:1258: first defined here
/usr/bin/ld: CpuAes.o:./src/Crypto/CpuAes.h:1295: multiple definition of `t_im'; CpuCore.o:./src/./Crypto/CpuAes.h:1295: first defined here
/usr/bin/ld: CpuAes.o:./src/Crypto/CpuAes.h:1251: multiple definition of `t_fn'; CpuCore.o:./src/./Crypto/CpuAes.h:1251: first defined here
/usr/bin/ld: CpuAes.o:./src/Crypto/CpuAes.h:1265: multiple definition of `t_in'; CpuCore.o:./src/./Crypto/CpuAes.h:1265: first defined here
/usr/bin/ld: CpuAes.o:./src/Crypto/CpuAes.h:1272: multiple definition of `t_il'; CpuCore.o:./src/./Crypto/CpuAes.h:1272: first defined here
/usr/bin/ld: CpuAes.o:./src/Crypto/CpuAes.h:1233: multiple definition of `t_rc'; CpuCore.o:./src/./Crypto/CpuAes.h:1237: first defined here
collect2: error: ld returned 1 exit status
make[3]: *** [Makefile:516: truecrack] Error 1
make[3]: Leaving directory '/<<PKGBUILDDIR>>/src'
make[2]: *** [Makefile:469: all-recursive] Error 1
make[2]: Leaving directory '/<<PKGBUILDDIR>>'
make[1]: *** [Makefile:346: all] Error 2
make[1]: Leaving directory '/<<PKGBUILDDIR>>'

Full worker log Full build log