History

For what's coming up, see the queue.

Last 100 runs:

Finish Time Package Suite Worker Duration Result Summary
2022-01-21T05:34 ruby-opengl fresh-releases atlas.kali.org 14m52s success
2022-01-21T05:20 asysocks fresh-releases atlas.kali.org 27s nothing-to-do Last upstream version 0.1.2 already imported. Import a snapshot by specifying --snapshot.
2022-01-21T05:19 python-config fresh-releases atlas.kali.org 10m38s success
2022-01-21T05:08 python-iptools fresh-releases atlas.kali.org 12m18s success
2022-01-21T04:56 pysmb fresh-releases atlas.kali.org 10m53s success
2022-01-21T04:45 arjun fresh-releases atlas.kali.org 11m22s success
2022-01-21T04:33 robotstxt fresh-releases atlas.kali.org 10m19s success
2022-01-21T04:23 chisel fresh-releases atlas.kali.org 11m23s success
2022-01-21T04:11 js2py lintian-fixes atlas.kali.org 9m53s success
2022-01-21T04:01 python-simplekv fresh-releases atlas.kali.org 10m6s success
2022-01-21T03:51 nethunter-utils fresh-releases atlas.kali.org 9m34s success
2022-01-21T03:41 golang-github-jawher-mow.cli fresh-releases atlas.kali.org 10m25s success
2022-01-21T03:31 python-webargs fresh-releases atlas.kali.org 10m37s success
2022-01-21T03:20 pywerview fresh-releases atlas.kali.org 24s nothing-to-do Last upstream version 0.3.2 already imported. Import a snapshot by specifying --snapshot.
2022-01-21T03:20 python-promise fresh-releases atlas.kali.org 10m36s success
2022-01-21T03:09 pywinrm fresh-releases atlas.kali.org 11m13s success
2022-01-21T02:58 eyewitness fresh-releases atlas.kali.org 43s nothing-to-do Last upstream version 20220110.1 already merged.
2022-01-21T02:57 pyspnego fresh-releases atlas.kali.org 11m6s success
2022-01-21T02:45 reaver fresh-releases atlas.kali.org 17s nothing-to-do Last upstream version 1.6.6 already imported. Import a snapshot by specifying --snapshot.
2022-01-21T02:45 python-minidump fresh-releases atlas.kali.org 22s nothing-to-do Last upstream version 0.0.21 already imported. Import a snapshot by specifying --snapshot.
2022-01-21T02:45 python-flask-classful fresh-releases atlas.kali.org 12m35s success
2022-01-21T02:32 golang-github-go-git-go-billy-v5 fresh-releases atlas.kali.org 10m51s success
2022-01-21T02:21 pyexcel-io fresh-releases atlas.kali.org 1m15s quilt-refresh-error An error occurred refreshing quilt patch remove-created-csv-files-created-in-tests.patch: Applying patch debian/patches/remove-created-csv-files-created-in-tests.patch patching file tests/test_io.py Hunk #1 FAILED at 197. Hunk #2 FAILED at 207. Hunk #3 FAILED at 217. 3 out of 3 hunks FAILED -- rejects in file tests/test_io.py Patch debian/patches/remove-created-csv-files-created-in-tests.patch does not apply (enforce with -f)
2022-01-21T02:19 python-ldapdomaindump fresh-releases atlas.kali.org 10m21s success
2022-01-21T02:09 sqlalchemy-utc fresh-releases atlas.kali.org 10m3s success
2022-01-21T01:59 python-bluepy fresh-releases atlas.kali.org 22s nothing-to-do Last upstream version 1.3.0 already imported. Import a snapshot by specifying --snapshot.
2022-01-21T01:58 python-icmplib fresh-releases atlas.kali.org 9m46s success
2022-01-21T01:48 golang-github-weppos-publicsuffix-go fresh-releases atlas.kali.org 12m59s success
2022-01-21T01:35 python-piplapis fresh-releases atlas.kali.org 10m45s success
2022-01-21T01:24 python-lsassy fresh-releases atlas.kali.org 1m12s nothing-to-do Last upstream version 3.1.1 already imported. Import a snapshot by specifying --snapshot.
2022-01-21T01:23 cloud-enum fresh-releases atlas.kali.org 13s nothing-to-do Last upstream version 0.6 already imported. Import a snapshot by specifying --snapshot.
2022-01-21T01:23 python-sflock fresh-releases atlas.kali.org 11m0s success
2022-01-21T01:12 msldap fresh-releases atlas.kali.org 29s nothing-to-do Last upstream version 0.3.30 already imported. Import a snapshot by specifying --snapshot.
2022-01-21T01:11 golang-github-binject-go-donut fresh-releases atlas.kali.org 10m6s success
2022-01-21T01:01 mypy-boto3-ebs fresh-releases atlas.kali.org 11m7s success
2022-01-21T00:50 winacl fresh-releases atlas.kali.org 26s nothing-to-do Last upstream version 0.1.2 already imported. Import a snapshot by specifying --snapshot.
2022-01-21T00:49 aiowinreg fresh-releases atlas.kali.org 23s nothing-to-do Last upstream version 0.0.7 already imported. Import a snapshot by specifying --snapshot.
2022-01-21T00:48 golang-github-evilsocket-islazy fresh-releases atlas.kali.org 10m53s success
2022-01-21T00:37 aiocmd fresh-releases atlas.kali.org 10m11s success
2022-01-21T00:27 python-filebytes fresh-releases atlas.kali.org 8m9s success
2022-01-21T00:19 python-grequests fresh-releases atlas.kali.org 8m9s success
2022-01-21T00:11 python-ipwhois fresh-releases atlas.kali.org 8m10s success
2022-01-21T00:02 enumiax lintian-fixes atlas.kali.org 7m49s success
2022-01-20T23:54 finalrecon lintian-fixes atlas.kali.org 10m58s success
2022-01-20T23:43 libfindrtp lintian-fixes atlas.kali.org 7m14s success
2022-01-20T23:36 hostapd-wpe lintian-fixes atlas.kali.org 8m7s success
2022-01-20T23:28 python-icmplib lintian-fixes atlas.kali.org 7m24s success
2022-01-20T23:20 golang-github-projectdiscovery-gologger lintian-fixes atlas.kali.org 7m56s success
2022-01-20T23:12 odpi fresh-releases atlas.kali.org 2m41s quilt-refresh-error An error occurred refreshing quilt patch add-missing-flags.patch: Applying patch debian/patches/add-missing-flags.patch patching file Makefile Hunk #1 FAILED at 42. 1 out of 1 hunk FAILED -- rejects in file Makefile Patch debian/patches/add-missing-flags.patch does not apply (enforce with -f)
2022-01-20T23:09 cloudflare-scrape fresh-releases atlas.kali.org 20m21s build-failed-stage-build E AssertionError: When calling b'get [../../../../../../usr/lib/python3/dist-packages/requests/sessions.py line 546]' the exception message does not match. Expected to match regex: 'Unable to parse .* pass is missing from challenge form'
2022-01-20T22:49 ident-user-enum lintian-fixes atlas.kali.org 7m20s success
2022-01-20T22:41 cloudflare-scrape lintian-fixes atlas.kali.org 8m2s success
2022-01-20T22:33 ruby-fxruby fresh-releases atlas.kali.org 4m39s upstream-merged-conflicts Merging upstream version 1.6.45 resulted in conflicts.
2022-01-20T22:28 voiphopper lintian-fixes atlas.kali.org 8m28s build-missing-c-header Missing C Header: rpc/types.h
2022-01-20T22:20 neo4j-python-driver lintian-fixes atlas.kali.org 10m12s success
2022-01-20T22:10 i3-gaps fresh-releases atlas.kali.org 3m3s upstream-merged-conflicts Merging upstream version 4.20.1 resulted in conflicts.
2022-01-20T22:06 google-nexus-tools fresh-releases atlas.kali.org 4m39s build-failed-stage-build install: cannot stat 'bin/linux-i386-adb': No such file or directory
2022-01-20T22:02 golang-github-go-git-go-git-v5 fresh-releases atlas.kali.org 14m10s build-failed-stage-build src/github.com/go-git/go-git/v5/config/config.go:162:32: error: reference to undefined identifier ‘osfs.Default’
2022-01-20T21:47 pyexcel-xls fresh-releases atlas.kali.org 10m6s install-deps-unsatisfied-apt-dependencies Unsatisfied APT dependencies: python3-pyexcel-io:amd64 (>= 0.6.2)
2022-01-20T21:37 sipvicious fresh-releases atlas.kali.org 26m52s success
2022-01-20T21:10 kwin-style-kali lintian-fixes atlas.kali.org 15m14s success
2022-01-20T20:55 aioconsole lintian-fixes atlas.kali.org 10m21s success
2022-01-20T20:44 fudgec2 lintian-fixes atlas.kali.org 7m40s success
2022-01-20T20:36 python-bluepy fresh-releases atlas.kali.org 20s nothing-to-do Last upstream version 1.3.0 already imported. Import a snapshot by specifying --snapshot.
2022-01-20T20:36 urlcrazy lintian-fixes atlas.kali.org 18m5s post-build-command-missing bash: line 1: urlcrazy: command not found
2022-01-20T20:18 libcrypt-mcrypt-perl lintian-fixes atlas.kali.org 7m19s success
2022-01-20T20:10 pynput fresh-releases atlas.kali.org 13m12s success
2022-01-20T19:57 splinter fresh-releases atlas.kali.org 1m19s quilt-refresh-error An error occurred refreshing quilt patch Import-upstream-patch-1.patch: Applying patch debian/patches/Import-upstream-patch-1.patch patching file splinter/browser.py Hunk #1 FAILED at 59. 1 out of 1 hunk FAILED -- rejects in file splinter/browser.py patching file splinter/driver/lxmldriver.py Hunk #1 FAILED at 179. Hunk #2 FAILED at 412. 2 out of 2 hunks FAILED -- rejects in file splinter/driver/lxmldriver.py patching file splinter/driver/webdriver/__init__.py Hunk #1 FAILED at 572. 1 out of 1 hunk FAILED -- rejects in file splinter/driver/webdriver/__init__.py patching file splinter/driver/zopetestbrowser.py Hunk #1 FAILED at 166. 1 out of 1 hunk FAILED -- rejects in file splinter/driver/zopetestbrowser.py patching file tests/element.py Hunk #1 succeeded at 39 with fuzz 1 (offset 6 lines). patching file tests/find_elements.py Hunk #1 succeeded at 31 with fuzz 2 (offset 5 lines). patching file tests/static/index.html Hunk #1 FAILED at 80. Hunk #2 FAILED at 187. 2 out of 2 hunks FAILED -- rejects in file tests/static/index.html patching file tests/test_browser.py Hunk #1 succeeded at 15 with fuzz 2 (offset 2 lines). Hunk #2 FAILED at 61. 1 out of 2 hunks FAILED -- rejects in file tests/test_browser.py Patch debian/patches/Import-upstream-patch-1.patch does not apply (enforce with -f)
2022-01-20T19:56 python-graphene-sqlalchemy lintian-fixes atlas.kali.org 9m47s success
2022-01-20T19:46 pytest-factoryboy fresh-releases atlas.kali.org 1m11s quilt-refresh-error An error occurred refreshing quilt patch fix-for-pytest-6.patch: Applying patch debian/patches/fix-for-pytest-6.patch patching file pytest_factoryboy/plugin.py Hunk #1 FAILED at 113. Hunk #2 FAILED at 124. 2 out of 2 hunks FAILED -- rejects in file pytest_factoryboy/plugin.py Patch debian/patches/fix-for-pytest-6.patch does not apply (enforce with -f)
2022-01-20T19:44 eaphammer lintian-fixes atlas.kali.org 14m32s success
2022-01-20T19:30 python-magic-ahupp fresh-releases atlas.kali.org 1m5s quilt-refresh-error An error occurred refreshing quilt patch change-name.patch: Applying patch debian/patches/change-name.patch patching file setup.py Hunk #1 FAILED at 3. 1 out of 1 hunk FAILED -- rejects in file setup.py The next patch would delete the file magic.py, which does not exist! Applying it anyway. patching file magic.py Hunk #1 FAILED at 1. 1 out of 1 hunk FAILED -- rejects in file magic.py patching file magic_ahupp.py Patch debian/patches/change-name.patch does not apply (enforce with -f)
2022-01-20T19:29 python-simplekv lintian-fixes atlas.kali.org 7m56s success
2022-01-20T19:21 sparsebitset fresh-releases atlas.kali.org 10m27s build-missing-maven-artifacts Missing maven artifacts: ['junit:junit:jar:debian']
2022-01-20T19:10 python-lml fresh-releases atlas.kali.org 26m56s build-missing-python-module Missing python 3 module: pyexcel_test
2022-01-20T18:43 cloud-enum fresh-releases atlas.kali.org 15s nothing-to-do Last upstream version 0.6 already imported. Import a snapshot by specifying --snapshot.
2022-01-20T18:43 cisco-auditing-tool lintian-fixes atlas.kali.org 7m13s success
2022-01-20T18:35 ropper fresh-releases atlas.kali.org 5m27s build-failed-stage-build ERROR: test_gadgets (testcases.test_x86_64.MACHO_x86_84)
2022-01-20T18:30 travispy lintian-fixes atlas.kali.org 10m53s success
2022-01-20T18:19 python-minikerberos lintian-fixes atlas.kali.org 43s nothing-to-do No changes made
2022-01-20T18:18 gospider fresh-releases atlas.kali.org 1m13s quilt-refresh-error An error occurred refreshing quilt patch Change-path-github.com-theblackturtle-gospider-to-github..patch: Applying patch debian/patches/Change-path-github.com-theblackturtle-gospider-to-github..patch patching file core/crawler.go Hunk #1 FAILED at 7. 1 out of 1 hunk FAILED -- rejects in file core/crawler.go patching file go.mod Hunk #1 FAILED at 1. 1 out of 1 hunk FAILED -- rejects in file go.mod patching file main.go Hunk #1 FAILED at 3. 1 out of 1 hunk FAILED -- rejects in file main.go Patch debian/patches/Change-path-github.com-theblackturtle-gospider-to-github..patch does not apply (enforce with -f)
2022-01-20T18:16 pypcapfile lintian-fixes atlas.kali.org 7m48s success
2022-01-20T18:08 fudgec2 fresh-releases atlas.kali.org 1m17s upstream-merged-conflicts Merging upstream version 1.0 resulted in conflicts.
2022-01-20T18:07 osrframework fresh-releases atlas.kali.org 1m17s quilt-refresh-error An error occurred refreshing quilt patch remove-useless-requirements.patch: Applying patch debian/patches/remove-useless-requirements.patch patching file requirements.txt Hunk #1 FAILED at 11. 1 out of 1 hunk FAILED -- rejects in file requirements.txt Patch debian/patches/remove-useless-requirements.patch does not apply (enforce with -f)
2022-01-20T18:06 robotstxt lintian-fixes atlas.kali.org 8m7s success
2022-01-20T17:57 gitleaks fresh-releases atlas.kali.org 1m30s upstream-merged-conflicts Merging upstream version 8.2.7 resulted in conflicts.
2022-01-20T17:56 pyexcel-io fresh-releases atlas.kali.org 1m13s quilt-refresh-error An error occurred refreshing quilt patch remove-created-csv-files-created-in-tests.patch: Applying patch debian/patches/remove-created-csv-files-created-in-tests.patch patching file tests/test_io.py Hunk #1 FAILED at 197. Hunk #2 FAILED at 207. Hunk #3 FAILED at 217. 3 out of 3 hunks FAILED -- rejects in file tests/test_io.py Patch debian/patches/remove-created-csv-files-created-in-tests.patch does not apply (enforce with -f)
2022-01-20T17:54 pyjsparser lintian-fixes atlas.kali.org 7m58s success
2022-01-20T17:46 powershell-empire fresh-releases atlas.kali.org 5m54s worker-failure KeyError: 'new-98'
2022-01-20T17:40 rfidiot lintian-fixes atlas.kali.org 8m20s success
2022-01-20T17:32 cloudscraper lintian-fixes atlas.kali.org 8m59s success
2022-01-20T17:23 pyuserinput lintian-fixes atlas.kali.org 9m11s success
2022-01-20T17:13 golang-github-domainr-whoistest fresh-releases atlas.kali.org 15m18s success
2022-01-20T16:58 exploitdb-bin-sploits fresh-releases atlas.kali.org 17m11s uscan-watch-line-without-matches UScan did not find matches for line: https://github.com/offensive-security/exploit-database-bin-sploits/releases .*/?(\d{4}-\d{2}-\d{2})\.tar\.gz
2022-01-20T16:41 spooftooph lintian-fixes atlas.kali.org 7m30s success
2022-01-20T16:33 xspy lintian-fixes atlas.kali.org 7m21s success
2022-01-20T16:26 neo4j-python-driver fresh-releases atlas.kali.org 1m14s quilt-refresh-error An error occurred refreshing quilt patch less-restrictive-version.patch: Applying patch debian/patches/less-restrictive-version.patch patching file requirements.txt Hunk #1 FAILED at 1. 1 out of 1 hunk FAILED -- rejects in file requirements.txt Patch debian/patches/less-restrictive-version.patch does not apply (enforce with -f)
2022-01-20T16:24 spyse-python lintian-fixes atlas.kali.org 7m49s success
2022-01-20T16:16 python-flask-session fresh-releases atlas.kali.org 59s quilt-refresh-error An error occurred refreshing quilt patch drop-special-themes.patch: Applying patch debian/patches/drop-special-themes.patch patching file docs/conf.py Hunk #1 FAILED at 106. 1 out of 1 hunk FAILED -- rejects in file docs/conf.py Patch debian/patches/drop-special-themes.patch does not apply (enforce with -f)
2022-01-20T16:15 reaver fresh-releases atlas.kali.org 19s nothing-to-do Last upstream version 1.6.6 already imported. Import a snapshot by specifying --snapshot.